当前日期:2018年11月14日 星期三
          欢迎来到我的博客!
          搜索 导航

          【热血传奇sf】新开单职业传奇|zhaosf|haosf-u9u9.net

          当前位置:首页 - 传奇资讯 - 正文
          阅读模式

          1.95 Failed to compile one of the

          2018-06-28 | 传奇资讯 | u9u9 | 82°c

          perkins+will was selected following an international design competition that included entries from some of the world&rsquo。

          the table shows the most important aspect of claims, which is that i have already been using them when i implemented the traditional authentication and authorization features in chapter 14. you can see that some of the claims relate to user identity (the name claim is alice, and the nameidentifier claim is alice’。

          the following code example demonstrates custom sorting using a sortcompare event handler. the selected datagridviewcolumn is sorted and, if there are duplicate values in the column, the id column is used to determine the final order.。

          after starting the computer this error message appears when you run the command ./manage.py runserver:。

          FATAL_ERROR:Simulator:Fuse.cpp:217:1.95 - Failed to compile one of the generated C code. Please recompile with -mt off -v 1 switch to identify which design unit failed. Process will terminate.

          How can I resolve this issue? Solution 1

          This fatal error might occur due to an unexpected condition while compiling the sources of your design.

          It might be possible to work around this fatal error by reviewing details of the fatal error.

          You can learn more about the nature of the fatal crash by enabling verbose debugging messages from the compiler.

          Using these messages, you can learn whether modifications to your source code can resolve the fatal error.

          Enabling Verbose Messaging :

          If using ISE Project Navigator:

          Add the switch "-v 1" in the Other Compiler Options property name, under the Simulate Behavioral/Post Place and Route Model properties (make sure the Property Display Level in this property window is set to Advanced).

          If using a batch file:

          Add "-v 1" to the fuse command.

          Please help us address this issue in a future update of the ISE Design Suite tools by informing Xilinx Technical Support of the issue.

          Contact information can be found at:

          Solution 2

          By default, the ISE Simulator compiler (fuse) uses multi-threading when compiling design sources.

          A fatal error might occur due to an unexpected compilation error while multi-threading is enabled.

          It might be possible to work around this fatal error by disabling multi-threading.

          Disabling Multi-Threading

          If using ISE Project Navigator:

          Add the switch "-mt off" in the Other Compiler Options property name. Under the Simulate Behavioral/Post Place and Route Model properties, make sure the Property Display Level in this property window is set to Advanced.

          If using a batch file:

          1.95合击辅助_1.95_1.95每日新开传奇网

          Add "-mt off" to the fuse command line.

          Refer to the ISim Help documentation for information on multi-threading.

          Please help Xilinx address this issue in a future update of the ISE Design Suite tools by informing Technical Support of the issue.

          Solution 3

          This fatal error can occur if the ISim compiler (fuse) is being run on an unsupported operating system.

          Check whether your operating system is supported by visiting the ISE Operating System Support Page at:

          Solution 4

          fatal error c1083.h': cannot open include file,wwpwei20012@163,也怕下得不全,希望能够解答的人士能直接发份完整的文件到我的邮箱。

          1>x.c : fatal error c1853: 'release\x.pch' precompiled header file is from a previous version of the compiler, or the precompiled header is c++ and you are using it from c (or vice versa)。

          link : fatal error lnk1123: failure during conversion to coff: file invalid or corrupt。

          2、link : fatal error lnk1123: failure during conversion to coff: file invalid or corrupt解决方法:。

          Certain DOS carriage return characters can cause the ISim compiler to fail.

          Solution 5

          This is a known issue with ISim in ISE Design Suite 11.1 tools and it has been fixed in ISE Design Suite 11 Update 2 (11.2).

          Please download and install the latest ISE Design Suite version from the Download Center at:

          Solution 6

          This fatal error can occur if the GNU Compiler (GCC) is missing or has not been installed on your machine.

          Use verbose messaging (as shown in Solution 1) to learn whether there are errors issued when ISim attempts to launch GCC.

          dear sir/madam,i am inquiring about an error message. can you please tell me the meaning when a error message states" eigenmodes are not strictly linear".second when an error message appears the values are in yellow. how accurate are they。

          // create new output read handle and the input write handles. set// the properties to false. otherwise, the child inherits the// properties and, as a result, non-closeable handles to the pipes// are created.if (。

          error can be to ignore errors, or non- to report errors.if an error is set, the function returns . errorsare reported even if they occur in the child (for example if theexecutable in argv[0] is not found). typicallythe message field of returned errors should be displayedto users. possible errors are those from the domain.。

          when you hover your mouse over the icon, you should see that the services are running. if they are not, you can click on the icon and start the service.。

          Refer to (Xilinx Answer 33845) for more information on how to identify and resolve this issue.

          Solution 7

          This fatal error can occur when compiling some designs that require a large amount of memory (~2GB) on a 32-bit system.

          otherwise, the lcd monitor may switch to the viewfinder. if you can not see anything on the lcd monitor, please press finder/lcd button.。

          otherwise, the lcd monitor may switch to the viewfinder. if you can not see anything on the lcd monitor, please press finder/lcd button。

          one important aspect of this guide is that the compiler is built with hardfloat support. one of the major features of the arm cortex-m4 series is the hardware acceleration of floating point operations。

          13. found out which version of atlbase.h the compiler was utilizing (in my case, because of the path that i set, the version i used was at c:\program files\microsoft platform sdk\include\atl. edit that file and comment out the line #pragma comment(lib, "atlthunk.lib") which was on or around line 293.。

          If a large amount of memory is used prior to the fatal crash, please simulate the design on a supported 64-bit environment.

          This issue is currently under investigation in order to better address this condition in a future release of the ISE Simulator.

          1.95合击辅助_1.95每日新开传奇网_1.95

          Please inform Xilinx Technical Support of the issue by contacting them at:

          Solution 8

          This fatal error can occur if the $timeformat Verilog system task is used in the design.

          This issue has been fixed in ISE Design Suite 11 Update 2 (11.2).

          Please download and install the latest ISE Design Suite update from the Download Center at:

          Solution 9

          colonel saito: a word to you about escape. there is no barbed wire. no stockade. no watchtower. they are not necessary. we are an island in the jungle. escape is impossible. you would die.。

          fatal error: call to a member function mget() on boolean in /home/q/pkgs/pandaren-0.3.2.435-120392924/src/logic/bizdomain/live_cache.php on line 76。

          the last-modified response header can be used as a weak validator. it is considered weak because it only has 1-second resolution. if the last-modified header is present in a response, then the client can issue an if-modified-since request header to validate the cached document.。

          * disable the lpm timeouts, so this can return an error code.。

          For example:

          Port ( S : in STD_LOGIC_VECTOR;

          A : out STD_LOGIC_VECTOR(n-1 downto 0);

          B : out STD_LOGIC_VECTOR(n-1 downto 0);

          C : out STD_LOGIC_VECTOR(n-1 downto 0);

          Adding "(n-1 downto 0)" to the S port above resolves the fatal error. 链接问答记录相关答复记录

          AR# 32357

          ISE - 10.1

          ISE Design Suite - 11.1

          ISE Design Suite - 11.2

          ISE Design Suite - 11.3

          ISE Design Suite - 11.4

          ISE Design Suite - 11.5

          ISE Design Suite - 12.1

          ISE Design Suite - 12.2

          ISE Design Suite - 12.3

          ISE Design Suite - 12.4

          版权声明

          www.u9u9.net
          分享:
          QR:  1.95 Failed to compile one of the

          扫一扫,用手机打开吧

          共0条评论

          暂时没有评论,你可以来抢个沙发!

          发表评论

          ◎欢迎参与讨论,请在这里发表您的看法、交流您的观点。